{"text_format":"1","workbook":"xlsx","n_sheets":6,"sheets":["Project Assumptions","Group","Employee Rates","Copy To Sharepoint","Instructions","Data Tables"],"not_rendered":{"charts":0,"images":0,"macros":1,"external_links":0,"defined_names":3,"comments":0,"pivot_tables":0},"unopened":[],"bounds":{"document_bytes":16777216,"sheet_cells":100000,"rows_first":2000,"rows_last":500,"rows_between":2000,"halvings":0,"cell_chars":16384,"cell_head_chars":4096},"cells_cut":0,"cells_raw":0,"read":"whole","date_system":"1900"}

{"sheet":"Project Assumptions","index":0,"n_rows":36,"n_cols":13,"rows_kept":36,"cut":false,"hidden":false,"merged":[[15,5,35,8],[3,3,3,5],[4,3,4,5],[1,1,1,6],[8,1,8,2],[7,1,7,2],[3,1,3,2],[4,1,4,2],[5,1,5,2],[5,3,5,5]]}
[]
[null,"Fixed Fee per Hour Calculation Worksheet",null,null,null,null,null,"Rev. 7/7/2017"]
[null,null,null,null,null,null,null,"Today's Date:",null,null,null,{"$f":"IF(OR(ISBLANK(I3),ISBLANK(I4),ISBLANK(I5),ISBLANK(I6))=TRUE,\"No\",\"Yes\")","v":"No"},"<---Are all wage escalation factor computation cells completed? (cells I3:I6)"]
[null,"Agreement No.:",null,null,null,null,null,"Project Start Date:"]
[null,"C-R-S:",null,null,null,null,null,"Project End Date:",null,null,null,{"$f":"IF(OR(ISBLANK(D9),ISBLANK(D8))=TRUE,\"No\",\"Yes\")","v":"No"},"<---Are all fixed fee computation cells completed?  (cells D8:D9)"]
[null,"Firm Name:",null,null,null,null,null,"Annual Wage Escalation %:"]
[]
[null,"Weighted Avg OH:",null,1.5808]
[null,"Net Fee:"]
[]
[null,null,null,null,null,"Instructions"]
[null,null,"Group","Fixed Fee"]
[null,null,1,{"$f":"'Data Tables'!F8","v":0}]
[null,null,2,{"$f":"'Data Tables'!F9","v":0},null,"Special instructions to ODOT (optional):"]
[null,null,3,{"$f":"'Data Tables'!F10","v":0},null,"Type Alt+Enter for a new paragraph"]
[null,null,4,{"$f":"'Data Tables'!F11","v":0}]
[null,null,5,{"$f":"'Data Tables'!F12","v":0}]
[null,null,6,{"$f":"'Data Tables'!F13","v":0}]
[null,null,7,{"$f":"'Data Tables'!F14","v":0}]
[null,null,8,{"$f":"'Data Tables'!F15","v":0}]
[null,null,9,{"$f":"'Data Tables'!F16","v":0}]
[null,null,10,{"$f":"'Data Tables'!F17","v":0}]
[null,null,11,{"$f":"'Data Tables'!F18","v":0}]
[null,null,12,{"$f":"'Data Tables'!F19","v":0}]
[null,null,13,{"$f":"'Data Tables'!F20","v":0}]
[null,null,14,{"$f":"'Data Tables'!F21","v":0}]
[null,null,15,{"$f":"'Data Tables'!F22","v":0}]
[null,null,16,{"$f":"'Data Tables'!F23","v":0}]
[null,null,17,{"$f":"'Data Tables'!F24","v":0}]
[null,null,18,{"$f":"'Data Tables'!F25","v":0}]
{"$rows_left_out":7}
{"sheet":"Group","index":1,"n_rows":219,"n_cols":4,"rows_kept":219,"cut":false,"hidden":true,"merged":[[2,1,2,2],[3,1,3,2],[4,1,4,2],[0,0,0,4]]}
["Employee Identifcation by Group"]
[]
[null,"Agreement No.:",null,{"$f":"'Project Assumptions'!$D$4","v":0}]
[null,"C-R-S:",null,{"$f":"'Project Assumptions'!$D$5","v":0}]
[null,"Firm Name:",null,{"$f":"'Project Assumptions'!$D$6","v":0}]
[]
[null,"Raw Rate Range $<15",null,"Raw Rate Range $15.01<$20"]
[null,"Group 1",null,"Group 2"]
[null,"Name",null,"Name"]
[]
[]
[]
[]
[]
[]
[]
[]
[]
[]
[]
[]
[]
[]
[]
[]
[]
[null,"Raw Rate Range $20.01<$25",null,"Raw Rate Range $25.01<$30"]
[null,"Group 3",null,"Group 4"]
[null,"Name",null,"Name"]
[]
{"$rows_left_out":190}
{"sheet":"Employee Rates","index":2,"n_rows":209,"n_cols":7,"rows_kept":209,"cut":false,"hidden":false,"merged":[[5,1,5,2],[5,3,5,7],[1,1,1,7],[3,3,3,7],[4,3,4,7],[3,1,3,2],[4,1,4,2]]}
[]
[null,"Employee Names and Hourly Pay Rates"]
[]
[null,"Agreement No.:",null,{"$f":"IF(ISBLANK('Project Assumptions'!D4),\"\",'Project Assumptions'!D4)","v":""}]
[null,"C-R-S:",null,{"$f":"IF(ISBLANK('Project Assumptions'!D5),\"\",'Project Assumptions'!D5)","v":""}]
[null,"Firm Name:",null,{"$f":"IF(ISBLANK('Project Assumptions'!D6),\"\",'Project Assumptions'!D6)","v":""}]
[]
[]
[null,"Employee Name","Pay Rate","Esc. Pay Rate","Group","Fixed Fee"]
[null,null,null,{"$f":"IF(ISBLANK(C10),\"\",IF('Project Assumptions'!$L$3=\"No\",'Employee Rates'!C10,ROUND(C10*'Data Tables'!$P$17,2)))","v":""},{"$f":"IF(ISBLANK(C10),\"\",VLOOKUP(D10,'Data Tables'!$C$8:$G$31,5))","v":""},{"$f":"IF(ISBLANK(C10),\"\",VLOOKUP(E10,'Project Assumptions'!$C$13:$D$36,2,FALSE))","v":""},"<--Enter employee names and actual pay rates as of today's date. Salaried employee rates should be based on methodology (standard or effective) consistently used by the firm."]
[null,null,null,{"$f":"IF(ISBLANK(C11),\"\",IF('Project Assumptions'!$L$3=\"No\",'Employee Rates'!C11,ROUND(C11*'Data Tables'!$P$17,2)))","v":""},{"$f":"IF(ISBLANK(C11),\"\",VLOOKUP(D11,'Data Tables'!$C$8:$G$31,5))","v":""},{"$f":"IF(ISBLANK(C11),\"\",VLOOKUP(E11,'Project Assumptions'!$C$13:$D$36,2,FALSE))","v":""}]
[null,null,null,{"$f":"IF(ISBLANK(C12),\"\",IF('Project Assumptions'!$L$3=\"No\",'Employee Rates'!C12,ROUND(C12*'Data Tables'!$P$17,2)))","v":""},{"$f":"IF(ISBLANK(C12),\"\",VLOOKUP(D12,'Data Tables'!$C$8:$G$31,5))","v":""},{"$f":"IF(ISBLANK(C12),\"\",VLOOKUP(E12,'Project Assumptions'!$C$13:$D$36,2,FALSE))","v":""}]
[null,null,null,{"$f":"IF(ISBLANK(C13),\"\",IF('Project Assumptions'!$L$3=\"No\",'Employee Rates'!C13,ROUND(C13*'Data Tables'!$P$17,2)))","v":""},{"$f":"IF(ISBLANK(C13),\"\",VLOOKUP(D13,'Data Tables'!$C$8:$G$31,5))","v":""},{"$f":"IF(ISBLANK(C13),\"\",VLOOKUP(E13,'Project Assumptions'!$C$13:$D$36,2,FALSE))","v":""}]
[null,null,null,{"$f":"IF(ISBLANK(C14),\"\",IF('Project Assumptions'!$L$3=\"No\",'Employee Rates'!C14,ROUND(C14*'Data Tables'!$P$17,2)))","v":""},{"$f":"IF(ISBLANK(C14),\"\",VLOOKUP(D14,'Data Tables'!$C$8:$G$31,5))","v":""},{"$f":"IF(ISBLANK(C14),\"\",VLOOKUP(E14,'Project Assumptions'!$C$13:$D$36,2,FALSE))","v":""}]
[null,null,null,{"$f":"IF(ISBLANK(C15),\"\",IF('Project Assumptions'!$L$3=\"No\",'Employee Rates'!C15,ROUND(C15*'Data Tables'!$P$17,2)))","v":""},{"$f":"IF(ISBLANK(C15),\"\",VLOOKUP(D15,'Data Tables'!$C$8:$G$31,5))","v":""},{"$f":"IF(ISBLANK(C15),\"\",VLOOKUP(E15,'Project Assumptions'!$C$13:$D$36,2,FALSE))","v":""}]
[null,null,null,{"$f":"IF(ISBLANK(C16),\"\",IF('Project Assumptions'!$L$3=\"No\",'Employee Rates'!C16,ROUND(C16*'Data Tables'!$P$17,2)))","v":""},{"$f":"IF(ISBLANK(C16),\"\",VLOOKUP(D16,'Data Tables'!$C$8:$G$31,5))","v":""},{"$f":"IF(ISBLANK(C16),\"\",VLOOKUP(E16,'Project Assumptions'!$C$13:$D$36,2,FALSE))","v":""}]
[null,null,null,{"$f":"IF(ISBLANK(C17),\"\",IF('Project Assumptions'!$L$3=\"No\",'Employee Rates'!C17,ROUND(C17*'Data Tables'!$P$17,2)))","v":""},{"$f":"IF(ISBLANK(C17),\"\",VLOOKUP(D17,'Data Tables'!$C$8:$G$31,5))","v":""},{"$f":"IF(ISBLANK(C17),\"\",VLOOKUP(E17,'Project Assumptions'!$C$13:$D$36,2,FALSE))","v":""}]
[null,null,null,{"$f":"IF(ISBLANK(C18),\"\",IF('Project Assumptions'!$L$3=\"No\",'Employee Rates'!C18,ROUND(C18*'Data Tables'!$P$17,2)))","v":""},{"$f":"IF(ISBLANK(C18),\"\",VLOOKUP(D18,'Data Tables'!$C$8:$G$31,5))","v":""},{"$f":"IF(ISBLANK(C18),\"\",VLOOKUP(E18,'Project Assumptions'!$C$13:$D$36,2,FALSE))","v":""}]
[null,null,null,{"$f":"IF(ISBLANK(C19),\"\",IF('Project Assumptions'!$L$3=\"No\",'Employee Rates'!C19,ROUND(C19*'Data Tables'!$P$17,2)))","v":""},{"$f":"IF(ISBLANK(C19),\"\",VLOOKUP(D19,'Data Tables'!$C$8:$G$31,5))","v":""},{"$f":"IF(ISBLANK(C19),\"\",VLOOKUP(E19,'Project Assumptions'!$C$13:$D$36,2,FALSE))","v":""}]
[null,null,null,{"$f":"IF(ISBLANK(C20),\"\",IF('Project Assumptions'!$L$3=\"No\",'Employee Rates'!C20,ROUND(C20*'Data Tables'!$P$17,2)))","v":""},{"$f":"IF(ISBLANK(C20),\"\",VLOOKUP(D20,'Data Tables'!$C$8:$G$31,5))","v":""},{"$f":"IF(ISBLANK(C20),\"\",VLOOKUP(E20,'Project Assumptions'!$C$13:$D$36,2,FALSE))","v":""}]
[null,null,null,{"$f":"IF(ISBLANK(C21),\"\",IF('Project Assumptions'!$L$3=\"No\",'Employee Rates'!C21,ROUND(C21*'Data Tables'!$P$17,2)))","v":""},{"$f":"IF(ISBLANK(C21),\"\",VLOOKUP(D21,'Data Tables'!$C$8:$G$31,5))","v":""},{"$f":"IF(ISBLANK(C21),\"\",VLOOKUP(E21,'Project Assumptions'!$C$13:$D$36,2,FALSE))","v":""}]
[null,null,null,{"$f":"IF(ISBLANK(C22),\"\",IF('Project Assumptions'!$L$3=\"No\",'Employee Rates'!C22,ROUND(C22*'Data Tables'!$P$17,2)))","v":""},{"$f":"IF(ISBLANK(C22),\"\",VLOOKUP(D22,'Data Tables'!$C$8:$G$31,5))","v":""},{"$f":"IF(ISBLANK(C22),\"\",VLOOKUP(E22,'Project Assumptions'!$C$13:$D$36,2,FALSE))","v":""}]
[null,null,null,{"$f":"IF(ISBLANK(C23),\"\",IF('Project Assumptions'!$L$3=\"No\",'Employee Rates'!C23,ROUND(C23*'Data Tables'!$P$17,2)))","v":""},{"$f":"IF(ISBLANK(C23),\"\",VLOOKUP(D23,'Data Tables'!$C$8:$G$31,5))","v":""},{"$f":"IF(ISBLANK(C23),\"\",VLOOKUP(E23,'Project Assumptions'!$C$13:$D$36,2,FALSE))","v":""}]
[null,null,null,{"$f":"IF(ISBLANK(C24),\"\",IF('Project Assumptions'!$L$3=\"No\",'Employee Rates'!C24,ROUND(C24*'Data Tables'!$P$17,2)))","v":""},{"$f":"IF(ISBLANK(C24),\"\",VLOOKUP(D24,'Data Tables'!$C$8:$G$31,5))","v":""},{"$f":"IF(ISBLANK(C24),\"\",VLOOKUP(E24,'Project Assumptions'!$C$13:$D$36,2,FALSE))","v":""}]
[null,null,null,{"$f":"IF(ISBLANK(C25),\"\",IF('Project Assumptions'!$L$3=\"No\",'Employee Rates'!C25,ROUND(C25*'Data Tables'!$P$17,2)))","v":""},{"$f":"IF(ISBLANK(C25),\"\",VLOOKUP(D25,'Data Tables'!$C$8:$G$31,5))","v":""},{"$f":"IF(ISBLANK(C25),\"\",VLOOKUP(E25,'Project Assumptions'!$C$13:$D$36,2,FALSE))","v":""}]
[null,null,null,{"$f":"IF(ISBLANK(C26),\"\",IF('Project Assumptions'!$L$3=\"No\",'Employee Rates'!C26,ROUND(C26*'Data Tables'!$P$17,2)))","v":""},{"$f":"IF(ISBLANK(C26),\"\",VLOOKUP(D26,'Data Tables'!$C$8:$G$31,5))","v":""},{"$f":"IF(ISBLANK(C26),\"\",VLOOKUP(E26,'Project Assumptions'!$C$13:$D$36,2,FALSE))","v":""}]
[null,null,null,{"$f":"IF(ISBLANK(C27),\"\",IF('Project Assumptions'!$L$3=\"No\",'Employee Rates'!C27,ROUND(C27*'Data Tables'!$P$17,2)))","v":""},{"$f":"IF(ISBLANK(C27),\"\",VLOOKUP(D27,'Data Tables'!$C$8:$G$31,5))","v":""},{"$f":"IF(ISBLANK(C27),\"\",VLOOKUP(E27,'Project Assumptions'!$C$13:$D$36,2,FALSE))","v":""}]
[null,null,null,{"$f":"IF(ISBLANK(C28),\"\",IF('Project Assumptions'!$L$3=\"No\",'Employee Rates'!C28,ROUND(C28*'Data Tables'!$P$17,2)))","v":""},{"$f":"IF(ISBLANK(C28),\"\",VLOOKUP(D28,'Data Tables'!$C$8:$G$31,5))","v":""},{"$f":"IF(ISBLANK(C28),\"\",VLOOKUP(E28,'Project Assumptions'!$C$13:$D$36,2,FALSE))","v":""}]
[null,null,null,{"$f":"IF(ISBLANK(C29),\"\",IF('Project Assumptions'!$L$3=\"No\",'Employee Rates'!C29,ROUND(C29*'Data Tables'!$P$17,2)))","v":""},{"$f":"IF(ISBLANK(C29),\"\",VLOOKUP(D29,'Data Tables'!$C$8:$G$31,5))","v":""},{"$f":"IF(ISBLANK(C29),\"\",VLOOKUP(E29,'Project Assumptions'!$C$13:$D$36,2,FALSE))","v":""}]
[null,null,null,{"$f":"IF(ISBLANK(C30),\"\",IF('Project Assumptions'!$L$3=\"No\",'Employee Rates'!C30,ROUND(C30*'Data Tables'!$P$17,2)))","v":""},{"$f":"IF(ISBLANK(C30),\"\",VLOOKUP(D30,'Data Tables'!$C$8:$G$31,5))","v":""},{"$f":"IF(ISBLANK(C30),\"\",VLOOKUP(E30,'Project Assumptions'!$C$13:$D$36,2,FALSE))","v":""}]
{"$rows_left_out":180}
{"sheet":"Copy To Sharepoint","index":3,"n_rows":213,"n_cols":5,"rows_kept":213,"cut":false,"hidden":false,"merged":[[1,2,1,7],[5,3,5,7],[3,3,3,7],[4,3,4,7]]}
[]
[null,null,"Fixed Fee per Hour by Employee"]
[]
[null,null,"ODOT Agreement Number:",{"$f":"IF(ISBLANK('Project Assumptions'!D4),\"\",'Project Assumptions'!D4)","v":""}]
[null,null,"C-R-S:",{"$f":"IF(ISBLANK('Project Assumptions'!D5),\"\",'Project Assumptions'!D5)","v":""}]
[null,null,"Firm Name:",{"$f":"IF(ISBLANK('Project Assumptions'!D6),\"\",'Project Assumptions'!D6)","v":""}]
[]
[null,null,"Employee Name","Hourly Fixed Fee","Group"]
[null,{"$f":"IF(C9=\"\",\"N\",\"Y\")","v":"N"},{"$f":"IF(ISBLANK('Employee Rates'!B10),\"\",'Employee Rates'!B10)","v":""},{"$f":"IF(ISBLANK('Employee Rates'!B10),\"\",'Employee Rates'!F10)","v":""},{"$f":"IF(ISBLANK('Employee Rates'!B10),\"\",'Employee Rates'!E10)","v":""}]
[null,{"$f":"IF(C10=\"\",\"N\",\"Y\")","v":"N"},{"$f":"IF(ISBLANK('Employee Rates'!B11),\"\",'Employee Rates'!B11)","v":""},{"$f":"IF(ISBLANK('Employee Rates'!B11),\"\",'Employee Rates'!F11)","v":""},{"$f":"IF(ISBLANK('Employee Rates'!B11),\"\",'Employee Rates'!E11)","v":""}]
[null,"N",{"$f":"IF(ISBLANK('Employee Rates'!B12),\"\",'Employee Rates'!B12)","v":""},{"$f":"IF(ISBLANK('Employee Rates'!B12),\"\",'Employee Rates'!F12)","v":""},{"$f":"IF(ISBLANK('Employee Rates'!B12),\"\",'Employee Rates'!E12)","v":""}]
[null,"N",{"$f":"IF(ISBLANK('Employee Rates'!B13),\"\",'Employee Rates'!B13)","v":""},{"$f":"IF(ISBLANK('Employee Rates'!B13),\"\",'Employee Rates'!F13)","v":""},{"$f":"IF(ISBLANK('Employee Rates'!B13),\"\",'Employee Rates'!E13)","v":""}]
[null,"N",{"$f":"IF(ISBLANK('Employee Rates'!B14),\"\",'Employee Rates'!B14)","v":""},{"$f":"IF(ISBLANK('Employee Rates'!B14),\"\",'Employee Rates'!F14)","v":""},{"$f":"IF(ISBLANK('Employee Rates'!B14),\"\",'Employee Rates'!E14)","v":""}]
[null,"N",{"$f":"IF(ISBLANK('Employee Rates'!B15),\"\",'Employee Rates'!B15)","v":""},{"$f":"IF(ISBLANK('Employee Rates'!B15),\"\",'Employee Rates'!F15)","v":""},{"$f":"IF(ISBLANK('Employee Rates'!B15),\"\",'Employee Rates'!E15)","v":""}]
[null,"N",{"$f":"IF(ISBLANK('Employee Rates'!B16),\"\",'Employee Rates'!B16)","v":""},{"$f":"IF(ISBLANK('Employee Rates'!B16),\"\",'Employee Rates'!F16)","v":""},{"$f":"IF(ISBLANK('Employee Rates'!B16),\"\",'Employee Rates'!E16)","v":""}]
[null,"N",{"$f":"IF(ISBLANK('Employee Rates'!B17),\"\",'Employee Rates'!B17)","v":""},{"$f":"IF(ISBLANK('Employee Rates'!B17),\"\",'Employee Rates'!F17)","v":""},{"$f":"IF(ISBLANK('Employee Rates'!B17),\"\",'Employee Rates'!E17)","v":""}]
[null,"N",{"$f":"IF(ISBLANK('Employee Rates'!B18),\"\",'Employee Rates'!B18)","v":""},{"$f":"IF(ISBLANK('Employee Rates'!B18),\"\",'Employee Rates'!F18)","v":""},{"$f":"IF(ISBLANK('Employee Rates'!B18),\"\",'Employee Rates'!E18)","v":""}]
[null,"N",{"$f":"IF(ISBLANK('Employee Rates'!B19),\"\",'Employee Rates'!B19)","v":""},{"$f":"IF(ISBLANK('Employee Rates'!B19),\"\",'Employee Rates'!F19)","v":""},{"$f":"IF(ISBLANK('Employee Rates'!B19),\"\",'Employee Rates'!E19)","v":""}]
[null,"N",{"$f":"IF(ISBLANK('Employee Rates'!B20),\"\",'Employee Rates'!B20)","v":""},{"$f":"IF(ISBLANK('Employee Rates'!B20),\"\",'Employee Rates'!F20)","v":""},{"$f":"IF(ISBLANK('Employee Rates'!B20),\"\",'Employee Rates'!E20)","v":""}]
[null,"N",{"$f":"IF(ISBLANK('Employee Rates'!B21),\"\",'Employee Rates'!B21)","v":""},{"$f":"IF(ISBLANK('Employee Rates'!B21),\"\",'Employee Rates'!F21)","v":""},{"$f":"IF(ISBLANK('Employee Rates'!B21),\"\",'Employee Rates'!E21)","v":""}]
[null,"N",{"$f":"IF(ISBLANK('Employee Rates'!B22),\"\",'Employee Rates'!B22)","v":""},{"$f":"IF(ISBLANK('Employee Rates'!B22),\"\",'Employee Rates'!F22)","v":""},{"$f":"IF(ISBLANK('Employee Rates'!B22),\"\",'Employee Rates'!E22)","v":""}]
[null,"N",{"$f":"IF(ISBLANK('Employee Rates'!B23),\"\",'Employee Rates'!B23)","v":""},{"$f":"IF(ISBLANK('Employee Rates'!B23),\"\",'Employee Rates'!F23)","v":""},{"$f":"IF(ISBLANK('Employee Rates'!B23),\"\",'Employee Rates'!E23)","v":""}]
[null,"N",{"$f":"IF(ISBLANK('Employee Rates'!B24),\"\",'Employee Rates'!B24)","v":""},{"$f":"IF(ISBLANK('Employee Rates'!B24),\"\",'Employee Rates'!F24)","v":""},{"$f":"IF(ISBLANK('Employee Rates'!B24),\"\",'Employee Rates'!E24)","v":""}]
[null,"N",{"$f":"IF(ISBLANK('Employee Rates'!B25),\"\",'Employee Rates'!B25)","v":""},{"$f":"IF(ISBLANK('Employee Rates'!B25),\"\",'Employee Rates'!F25)","v":""},{"$f":"IF(ISBLANK('Employee Rates'!B25),\"\",'Employee Rates'!E25)","v":""}]
[null,"N",{"$f":"IF(ISBLANK('Employee Rates'!B26),\"\",'Employee Rates'!B26)","v":""},{"$f":"IF(ISBLANK('Employee Rates'!B26),\"\",'Employee Rates'!F26)","v":""},{"$f":"IF(ISBLANK('Employee Rates'!B26),\"\",'Employee Rates'!E26)","v":""}]
[null,"N",{"$f":"IF(ISBLANK('Employee Rates'!B27),\"\",'Employee Rates'!B27)","v":""},{"$f":"IF(ISBLANK('Employee Rates'!B27),\"\",'Employee Rates'!F27)","v":""},{"$f":"IF(ISBLANK('Employee Rates'!B27),\"\",'Employee Rates'!E27)","v":""}]
[null,"N",{"$f":"IF(ISBLANK('Employee Rates'!B28),\"\",'Employee Rates'!B28)","v":""},{"$f":"IF(ISBLANK('Employee Rates'!B28),\"\",'Employee Rates'!F28)","v":""},{"$f":"IF(ISBLANK('Employee Rates'!B28),\"\",'Employee Rates'!E28)","v":""}]
[null,"N",{"$f":"IF(ISBLANK('Employee Rates'!B29),\"\",'Employee Rates'!B29)","v":""},{"$f":"IF(ISBLANK('Employee Rates'!B29),\"\",'Employee Rates'!F29)","v":""},{"$f":"IF(ISBLANK('Employee Rates'!B29),\"\",'Employee Rates'!E29)","v":""}]
[null,"N",{"$f":"IF(ISBLANK('Employee Rates'!B30),\"\",'Employee Rates'!B30)","v":""},{"$f":"IF(ISBLANK('Employee Rates'!B30),\"\",'Employee Rates'!F30)","v":""},{"$f":"IF(ISBLANK('Employee Rates'!B30),\"\",'Employee Rates'!E30)","v":""}]
[null,"N",{"$f":"IF(ISBLANK('Employee Rates'!B31),\"\",'Employee Rates'!B31)","v":""},{"$f":"IF(ISBLANK('Employee Rates'!B31),\"\",'Employee Rates'!F31)","v":""},{"$f":"IF(ISBLANK('Employee Rates'!B31),\"\",'Employee Rates'!E31)","v":""}]
{"$rows_left_out":184}
{"sheet":"Instructions","index":4,"n_rows":30,"n_cols":4,"rows_kept":30,"cut":false,"hidden":false,"merged":[]}
[]
[]
[null,"Instructions"]
[]
[null,"The purpose of this spreadsheet is to categorize individual employees into pay groups to establish hourly fixed fees on consulting contracts using this pay type."]
[]
[null,"The consultant is to enter data into the yellow cells on the yellow tabs."]
[]
[null,"Step 1:"]
[null,"Complete the yellow cells in the Project Assumptions tab."]
[null,null,"The weighted average overhead rate is a number calculated annually by ODOT. Contact Consultant Services if you do not have this number."]
[null,null,"The project start and ends dates are estimates of the dates the consultant will be beginning and ending work on the project."]
[null,null,"The Annual Wage Escalation Percentage is the consultant's estimated average annual increase in employee wages."]
[]
[null,"Step 2:"]
[null,"Complete the yellow cells in the Employee Rates tab."]
[null,null,"Include all employees that may be working on the project."]
[null,null,null,"The sheet holds 200 employees. If more than 200 names are required, use a second template for the overflow."]
[null,null,"Identify the actual pay rates of employees, using rates as of the day the template is being completed."]
[null,null,null,"Do not factor in any anticipated raises, as they are already calculated in the template."]
[null,null,null,"For salaried employees, use the method employed by the company (i.e., standard or effective hourly rate) when allocating costs to direct and indirect labor."]
[]
[null,"Step 3:"]
[null,"Click the Sort Pay Rates macro button on the Copy to Sharepoint tab."]
[null,null,"The fixed fees will be shown on this tab."]
[]
[null,"Step 4:"]
[null,"Submit to ODOT."]
[]
[null,"Upon execution, ODOT will post to Sharepoint."]
{"$rows_left_out":1}
{"sheet":"Data Tables","index":5,"n_rows":31,"n_cols":17,"rows_kept":31,"cut":false,"hidden":false,"merged":[]}
[null,null,null,null,null,null,null,null,null,null,{"$f":"K4-K3+1","v":1}]
[null,null,null,null,null,null,null,null,null,"Today Year",{"$f":"ROUND(TEXT('Project Assumptions'!I3,\"yyyy\"),0)","v":1900},{"$f":"'Project Assumptions'!I3","v":"00:00:00"},null,"Proj. Len.",{"$f":"L4-L3+1","v":1},"<--Days"]
[null,null,null,null,null,null,null,null,null,"Start Year",{"$f":"ROUND(TEXT('Project Assumptions'!I4,\"yyyy\"),0)","v":1900},{"$f":"'Project Assumptions'!I4","v":"00:00:00"}]
[null,null,null,null,null,null,null,null,null,"End Year",{"$f":"ROUND(TEXT('Project Assumptions'!I5,\"yyyy\"),0)","v":1900},{"$f":"'Project Assumptions'!I5","v":"00:00:00"}]
[]
[null,null,null,null,null,null,null,null,null,"Year","Yr. Start","Yr End","Days","% of Proj","Esc. Factor","Weighted Esc."]
[null,"Group","Min Pay","Max Pay","Median","Net Fee",{"$f":"B7","v":"Group"},null,1,{"$f":"ROUND(K3,0)","v":1900},{"$f":"L3","v":"00:00:00"},{"$f":"IF(K7=\"\",\"\",IF(YEAR($L$3)=YEAR($L$4),$L$4,IF($K$4=J7,$L$4,EOMONTH(K7,12-TEXT(K7,\"mm\")))))","v":"00:00:00"},{"$f":"IF(J7=\"\",\"\",L7-K7+1)","v":1},{"$f":"IF(J7=\"\",\"\",M7/$O$2)","v":1},{"$f":"IF(J7=\"\",\"\",(1+'Project Assumptions'!$I$6)^(K3-K2))","v":1},{"$f":"IF(J7=\"\",\"\",N7*O7)","v":1}]
[null,1,0,15,{"$f":"D8-2.5","v":12.5},{"$f":"ROUND(E8*'Project Assumptions'!$D$8*'Project Assumptions'!$D$9+E8*'Project Assumptions'!$D$9,2)","v":0},{"$f":"B8","v":1},null,2,{"$f":"IF(I8>$K$1,\"\",ROUND(J7+1,0))","v":""},{"$f":"IF(J8=\"\",\"\",L7+1)","v":""},{"$f":"IF(K8=\"\",\"\",IF(YEAR($L$3)=YEAR($L$4),$L$4,IF($K$4=J8,$L$4,EOMONTH(K8,12-TEXT(K8,\"mm\")))))","v":""},{"$f":"IF(J8=\"\",\"\",L8-K8+1)","v":""},"",{"$f":"IF(J8=\"\",\"\",O7*(1+'Project Assumptions'!$I$6))","v":""},""]
[null,2,{"$f":"D8+0.01","v":15.01},{"$f":"D8+5","v":20},{"$f":"MEDIAN(D8:D9)","v":17.5},{"$f":"ROUND(E9*'Project Assumptions'!$D$8*'Project Assumptions'!$D$9+E9*'Project Assumptions'!$D$9,2)","v":0},2,null,3,{"$f":"IF(I9>$K$1,\"\",ROUND(J8+1,0))","v":""},{"$f":"IF(J9=\"\",\"\",L8+1)","v":""},"","","",{"$f":"IF(J9=\"\",\"\",O8*(1+'Project Assumptions'!$I$6))","v":""},""]
[null,3,{"$f":"D9+0.01","v":20.010000000000002},{"$f":"D9+5","v":25},{"$f":"MEDIAN(D9:D10)","v":22.5},{"$f":"ROUND(E10*'Project Assumptions'!$D$8*'Project Assumptions'!$D$9+E10*'Project Assumptions'!$D$9,2)","v":0},3,null,4,"","","","","",{"$f":"IF(J10=\"\",\"\",O9*(1+'Project Assumptions'!$I$6))","v":""},""]
[null,4,25.01,30,27.5,{"$f":"ROUND(E11*'Project Assumptions'!$D$8*'Project Assumptions'!$D$9+E11*'Project Assumptions'!$D$9,2)","v":0},4,null,5,"","","","","",{"$f":"IF(J11=\"\",\"\",O10*(1+'Project Assumptions'!$I$6))","v":""},""]
[null,5,30.01,35,32.5,{"$f":"ROUND(E12*'Project Assumptions'!$D$8*'Project Assumptions'!$D$9+E12*'Project Assumptions'!$D$9,2)","v":0},5,null,6,"","","","","",{"$f":"IF(J12=\"\",\"\",O11*(1+'Project Assumptions'!$I$6))","v":""},""]
[null,6,35.01,40,37.5,{"$f":"ROUND(E13*'Project Assumptions'!$D$8*'Project Assumptions'!$D$9+E13*'Project Assumptions'!$D$9,2)","v":0},6,null,7,"","","","","",{"$f":"IF(J13=\"\",\"\",O12*(1+'Project Assumptions'!$I$6))","v":""},""]
[null,7,40.01,45,42.5,{"$f":"ROUND(E14*'Project Assumptions'!$D$8*'Project Assumptions'!$D$9+E14*'Project Assumptions'!$D$9,2)","v":0},7,null,8,"","","","","",{"$f":"IF(J14=\"\",\"\",O13*(1+'Project Assumptions'!$I$6))","v":""},""]
[null,8,45.01,50,47.5,{"$f":"ROUND(E15*'Project Assumptions'!$D$8*'Project Assumptions'!$D$9+E15*'Project Assumptions'!$D$9,2)","v":0},8,null,9,"","","","","",{"$f":"IF(J15=\"\",\"\",O14*(1+'Project Assumptions'!$I$6))","v":""},""]
[null,9,50.01,55,52.5,{"$f":"ROUND(E16*'Project Assumptions'!$D$8*'Project Assumptions'!$D$9+E16*'Project Assumptions'!$D$9,2)","v":0},9,null,10,"","","","","",{"$f":"IF(J16=\"\",\"\",O15*(1+'Project Assumptions'!$I$6))","v":""},""]
[null,10,55.01,60,57.5,{"$f":"ROUND(E17*'Project Assumptions'!$D$8*'Project Assumptions'!$D$9+E17*'Project Assumptions'!$D$9,2)","v":0},10,null,null,null,null,null,null,{"$f":"SUM(N7:N16)","v":1},null,{"$f":"SUM(P7:P16)","v":1},"<---Escalation Factor"]
[null,11,60.01,65,62.5,{"$f":"ROUND(E18*'Project Assumptions'!$D$8*'Project Assumptions'!$D$9+E18*'Project Assumptions'!$D$9,2)","v":0},11]
[null,12,65.010000000000005,70,67.5,{"$f":"ROUND(E19*'Project Assumptions'!$D$8*'Project Assumptions'!$D$9+E19*'Project Assumptions'!$D$9,2)","v":0},12]
[null,13,70.010000000000005,75,72.5,{"$f":"ROUND(E20*'Project Assumptions'!$D$8*'Project Assumptions'!$D$9+E20*'Project Assumptions'!$D$9,2)","v":0},13]
[null,14,75.010000000000005,80,77.5,{"$f":"ROUND(E21*'Project Assumptions'!$D$8*'Project Assumptions'!$D$9+E21*'Project Assumptions'!$D$9,2)","v":0},14]
[null,15,80.010000000000005,85,82.5,{"$f":"ROUND(E22*'Project Assumptions'!$D$8*'Project Assumptions'!$D$9+E22*'Project Assumptions'!$D$9,2)","v":0},15]
[null,16,85.01,90,87.5,{"$f":"ROUND(E23*'Project Assumptions'!$D$8*'Project Assumptions'!$D$9+E23*'Project Assumptions'!$D$9,2)","v":0},16]
[null,17,90.01,95,92.5,{"$f":"ROUND(E24*'Project Assumptions'!$D$8*'Project Assumptions'!$D$9+E24*'Project Assumptions'!$D$9,2)","v":0},17]
[null,18,95.01,100,97.5,{"$f":"ROUND(E25*'Project Assumptions'!$D$8*'Project Assumptions'!$D$9+E25*'Project Assumptions'!$D$9,2)","v":0},18]
[null,19,100.01,105,102.5,{"$f":"ROUND(E26*'Project Assumptions'!$D$8*'Project Assumptions'!$D$9+E26*'Project Assumptions'!$D$9,2)","v":0},19]
[null,20,105.01,110,107.5,{"$f":"ROUND(E27*'Project Assumptions'!$D$8*'Project Assumptions'!$D$9+E27*'Project Assumptions'!$D$9,2)","v":0},20]
[null,21,110.01,115,112.5,{"$f":"ROUND(E28*'Project Assumptions'!$D$8*'Project Assumptions'!$D$9+E28*'Project Assumptions'!$D$9,2)","v":0},21]
[null,22,115.01,120,117.5,{"$f":"ROUND(E29*'Project Assumptions'!$D$8*'Project Assumptions'!$D$9+E29*'Project Assumptions'!$D$9,2)","v":0},22]
[null,23,120.01,125,122.5,{"$f":"ROUND(E30*'Project Assumptions'!$D$8*'Project Assumptions'!$D$9+E30*'Project Assumptions'!$D$9,2)","v":0},23]
{"$rows_left_out":1}